Reaction Details
TargetProthrombin
LigandBDBM50158161
Substrate/Competitorn/a
Meas. Tech.ChEMBL_1565756 (CHEMBL3782596)
Ki>100000±n/a nM
Citation Venukadasula, PKOwusu, BYBansal, NRoss, LJHobrath, JVBao, DTruss, JWStackhouse, MMessick, TEKlampfer, LGalemmo, RA Design and Synthesis of Nonpeptide Inhibitors of Hepatocyte Growth Factor Activation. ACS Med Chem Lett7:177-81 (2016) 
 
Prothrombin
Name:Prothrombin
Type:Protein
Mol. Mass.:70029.57
Organism:Homo sapiens (Human)
Description:P00734
Residue:622
BDBM50158161
NameBDBM50158161
Synonyms:CHEMBL3781405
TypeSmall organic molecule
Emp. Form.C32H38N6O2
Mol. Mass.538.6831
SMILESNC(=N)c1cccc(c1)N1CC(CNC(=O)c2ccccc2)CN(CC2CCN(Cc3ccccc3)CC2)C1=O