Reaction Details
TargetCoagulation factor X
LigandBDBM50071945
Substrate/Competitorn/a
Meas. Tech.ChEMBL_1565757 (CHEMBL3782597)
Ki 5400±n/a nM
Citation Venukadasula, PKOwusu, BYBansal, NRoss, LJHobrath, JVBao, DTruss, JWStackhouse, MMessick, TEKlampfer, LGalemmo, RA Design and Synthesis of Nonpeptide Inhibitors of Hepatocyte Growth Factor Activation. ACS Med Chem Lett7:177-81 (2016) 
 
Coagulation factor X
Name:Coagulation factor X
Type:Enzyme
Mol. Mass.:54726.60
Organism:Homo sapiens (Human)
Description:n/a
Residue:488
BDBM50071945
NameBDBM50071945
Synonyms:3-[3-(1-Benzyl-piperidin-4-yl)-ureido]-benzamidine | CHEMBL327254
TypeSmall organic molecule
Emp. Form.C20H25N5O
Mol. Mass.351.4454
SMILESNC(=N)c1cccc(NC(=O)NC2CCN(Cc3ccccc3)CC2)c1