Reaction Details
TargetSuppressor of tumorigenicity 14 protein
LigandBDBM50158151
Substrate/Competitorn/a
Meas. Tech.ChEMBL_1565752 (CHEMBL3782550)
Ki 330±n/a nM
Citation Venukadasula, PKOwusu, BYBansal, NRoss, LJHobrath, JVBao, DTruss, JWStackhouse, MMessick, TEKlampfer, LGalemmo, RA Design and Synthesis of Nonpeptide Inhibitors of Hepatocyte Growth Factor Activation. ACS Med Chem Lett7:177-81 (2016) 
 
Suppressor of tumorigenicity 14 protein
Name:Suppressor of tumorigenicity 14 protein
Type:Single-pass type II membrane protein
Mol. Mass.:94769.23
Organism:Homo sapiens (Human)
Description:Q9Y5Y6
Residue:855
BDBM50158151
NameBDBM50158151
Synonyms:CHEMBL3780273
TypeSmall organic molecule
Emp. Form.C25H34N6O3S
Mol. Mass.498.641
SMILESCS(=O)(=O)NC1CN(CC2CCN(Cc3ccccc3)CC2)C(=O)N(C1)c1cccc(c1)C(N)=N