Reaction Details
TargetSuppressor of tumorigenicity 14 protein
LigandBDBM50158164
Substrate/Competitorn/a
Meas. Tech.ChEMBL_1565752 (CHEMBL3782550)
Ki 15400±n/a nM
Citation Venukadasula, PKOwusu, BYBansal, NRoss, LJHobrath, JVBao, DTruss, JWStackhouse, MMessick, TEKlampfer, LGalemmo, RA Design and Synthesis of Nonpeptide Inhibitors of Hepatocyte Growth Factor Activation. ACS Med Chem Lett7:177-81 (2016) 
 
Suppressor of tumorigenicity 14 protein
Name:Suppressor of tumorigenicity 14 protein
Type:Single-pass type II membrane protein
Mol. Mass.:94769.23
Organism:Homo sapiens (Human)
Description:Q9Y5Y6
Residue:855
BDBM50158164
NameBDBM50158164
Synonyms:CHEMBL3780039
TypeSmall organic molecule
Emp. Form.C25H33N5O
Mol. Mass.419.5624
SMILESCC1CN(Cc2ccc(cc2)C(N)=N)C(=O)N(C1)C1CCN(Cc2ccccc2)CC1