Reaction Details
TargetProthrombin
LigandBDBM50158150
Substrate/Competitorn/a
Meas. Tech.ChEMBL_1565756 (CHEMBL3782596)
Ki 17000±n/a nM
Citation Venukadasula, PKOwusu, BYBansal, NRoss, LJHobrath, JVBao, DTruss, JWStackhouse, MMessick, TEKlampfer, LGalemmo, RA Design and Synthesis of Nonpeptide Inhibitors of Hepatocyte Growth Factor Activation. ACS Med Chem Lett7:177-81 (2016) 
 
Prothrombin
Name:Prothrombin
Type:Protein
Mol. Mass.:70029.57
Organism:Homo sapiens (Human)
Description:P00734
Residue:622
BDBM50158150
NameBDBM50158150
Synonyms:CHEMBL3780005
TypeSmall organic molecule
Emp. Form.C30H36N6O3S
Mol. Mass.560.71
SMILESNC(=N)c1cccc(c1)N1CC(CN(CC2CCN(Cc3ccccc3)CC2)C1=O)NS(=O)(=O)c1ccccc1