Reaction Details
TargetALK tyrosine kinase receptor
LigandBDBM50436850
Substrate/Competitorn/a
Meas. Tech.ChEMBL_1568144 (CHEMBL3791603)
IC50 14±n/a nM
Citation Song, DLee, MPark, CHAhn, SYun, CSLee, COKim, HRHwang, JY Novel 2,4-diaminopyrimidines bearing tetrahydronaphthalenyl moiety against anaplastic lymphoma kinase (ALK): Synthesis, in vitro, ex vivo, and in vivo efficacy studies. Bioorg Med Chem Lett26:1720-5 (2016) 
 
ALK tyrosine kinase receptor
Name:ALK tyrosine kinase receptor
Type:Protein
Mol. Mass.:176453.10
Organism:Homo sapiens (Human)
Description:Q9UM73
Residue:1620
BDBM50436850
NameBDBM50436850
Synonyms:CERITINIB LDK378 US10618884, Example 16 | US9809572, Example 16
TypeSmall organic molecule
Emp. Form.C28H36ClN5O3S
Mol. Mass.558.135
SMILESCC(C)Oc1cc(C2CCNCC2)c(C)cc1Nc1ncc(Cl)c(Nc2ccccc2S(=O)(=O)C(C)C)n1