Reaction Details
TargetSigma non-opioid intracellular receptor 1
LigandBDBM50157866
Substrate/Competitorn/a
Meas. Tech.ChEMBL_1569753 (CHEMBL3791697)
Ki 16±n/a nM
Citation Lan, YSongyang, YZhang, LPeng, YSong, J Synthesis and biological evaluation of novel 6,7-dihydro-5H-cyclopenta[d]pyrimidine and 5,6,7,8-tetrahydroquinazoline derivatives as sigma-1 (s1) receptor antagonists for the treatment of pain. Bioorg Med Chem Lett26:2051-6 (2016) 
 
Sigma non-opioid intracellular receptor 1
Name:Sigma non-opioid intracellular receptor 1
Type:Protein
Mol. Mass.:25307.17
Organism:Cavia porcellus (Guinea pig)
Description:Q60492
Residue:223
BDBM50157866
NameBDBM50157866
Synonyms:CHEMBL3785238
TypeSmall organic molecule
Emp. Form.C23H30ClN3O
Mol. Mass.399.957
SMILESCC1CCN(CCCOc2nc(nc3CCCCc23)-c2ccc(Cl)cc2)CC1