Reaction Details
TargetPotassium voltage-gated channel subfamily H member 2
LigandBDBM50157879
Substrate/Competitorn/a
Meas. Tech.ChEMBL_1570047 (CHEMBL3789410)
IC50 130±n/a nM
Citation Stauffer, FCowan-Jacob, SWScheufler, CFuret, P Identification of a 5-[3-phenyl-(2-cyclic-ether)-methylether]-4-aminopyrrolo[2,3-d]pyrimidine series of IGF-1R inhibitors. Bioorg Med Chem Lett26:2065-7 (2016) 
 
Potassium voltage-gated channel subfamily H member 2
Name:Potassium voltage-gated channel subfamily H member 2
Type:Multi-pass membrane protein
Mol. Mass.:126672.65
Organism:Homo sapiens (Human)
Description:Q12809
Residue:1159
BDBM50157879
NameBDBM50157879
Synonyms:CHEMBL1614712
TypeSmall organic molecule
Emp. Form.C27H29N5O
Mol. Mass.439.5521
SMILES[H][C@]1(CN2CCC2)C[C@]([H])(C1)n1cc(-c2cccc(OCc3ccccc3)c2)c2c(N)ncnc12