Reaction Details
TargetInsulin-like growth factor 1 receptor
LigandBDBM50157881
Substrate/Competitorn/a
Meas. Tech.ChEMBL_1570037 (CHEMBL3789400)
IC50 80±n/a nM
Citation Stauffer, FCowan-Jacob, SWScheufler, CFuret, P Identification of a 5-[3-phenyl-(2-cyclic-ether)-methylether]-4-aminopyrrolo[2,3-d]pyrimidine series of IGF-1R inhibitors. Bioorg Med Chem Lett26:2065-7 (2016) 
 
Insulin-like growth factor 1 receptor
Name:Insulin-like growth factor 1 receptor
Type:Protein
Mol. Mass.:154776.79
Organism:Homo sapiens (Human)
Description:P08069
Residue:1367
BDBM50157881
NameBDBM50157881
Synonyms:CHEMBL3787614
TypeSmall organic molecule
Emp. Form.C25H31N5O2
Mol. Mass.433.5459
SMILESNc1ncnc2n(cc(-c3cccc(OC[C@@H]4CCCO4)c3)c12)[C@@H]1C[C@H](CN2CCC2)C1