Reaction Details
TargetProtein arginine N-methyltransferase 6
LigandBDBM50158084
Substrate/Competitorn/a
Meas. Tech.ChEBML_1564181
IC50 100000±n/a nM
Citation Ferreira de Freitas, REram, MSSzewczyk, MMSteuber, HSmil, DWu, HLi, FSenisterra, GDong, ABrown, PJHitchcock, MMoosmayer, DStegmann, CMEgner, UArrowsmith, CBarsyte-Lovejoy, DVedadi, MSchapira, M Discovery of a Potent Class I Protein Arginine Methyltransferase Fragment Inhibitor. J Med Chem59:1176-83 (2016) 
 
Protein arginine N-methyltransferase 6
Name:Protein arginine N-methyltransferase 6
Type:Protein
Mol. Mass.:41928.48
Organism:Homo sapiens (Human)
Description:n/a
Residue:375
BDBM50158084
NameBDBM50158084
Synonyms:CHEMBL3780979
TypeSmall organic molecule
Emp. Form.C13H14N2
Mol. Mass.198.2637
SMILESCNCc1cccc(c1)-c1ccncc1