Reaction Details
TargetHistone-arginine methyltransferase CARM1
LigandBDBM50158087
Substrate/Competitorn/a
Meas. Tech.ChEMBL_1564180 (CHEMBL3784077)
IC50 105000±n/a nM
Citation Ferreira de Freitas, REram, MSSzewczyk, MMSteuber, HSmil, DWu, HLi, FSenisterra, GDong, ABrown, PJHitchcock, MMoosmayer, DStegmann, CMEgner, UArrowsmith, CBarsyte-Lovejoy, DVedadi, MSchapira, M Discovery of a Potent Class I Protein Arginine Methyltransferase Fragment Inhibitor. J Med Chem59:1176-83 (2016) 
 
Histone-arginine methyltransferase CARM1
Name:Histone-arginine methyltransferase CARM1
Type:Protein
Mol. Mass.:65855.47
Organism:Homo sapiens (Human)
Description:Q86X55
Residue:608
BDBM50158087
NameBDBM50158087
Synonyms:CHEMBL3781841
TypeSmall organic molecule
Emp. Form.C5H12N2O
Mol. Mass.116.1616
SMILESCCNC(=O)[C@@H](C)N