Reaction Details
TargetProtein arginine N-methyltransferase 6
LigandBDBM50158094
Substrate/Competitorn/a
Meas. Tech.ChEMBL_1564181 (CHEMBL3784078)
IC50 230±n/a nM
Citation Ferreira de Freitas, REram, MSSzewczyk, MMSteuber, HSmil, DWu, HLi, FSenisterra, GDong, ABrown, PJHitchcock, MMoosmayer, DStegmann, CMEgner, UArrowsmith, CBarsyte-Lovejoy, DVedadi, MSchapira, M Discovery of a Potent Class I Protein Arginine Methyltransferase Fragment Inhibitor. J Med Chem59:1176-83 (2016) 
 
Protein arginine N-methyltransferase 6
Name:Protein arginine N-methyltransferase 6
Type:Protein
Mol. Mass.:41928.48
Organism:Homo sapiens (Human)
Description:n/a
Residue:375
BDBM50158094
NameBDBM50158094
Synonyms:CHEMBL3780926
TypeSmall organic molecule
Emp. Form.C14H22N2
Mol. Mass.218.3379
SMILESNCCN1CCC(Cc2ccccc2)CC1