Reaction Details
TargetHistone-arginine methyltransferase CARM1
LigandBDBM50158095
Substrate/Competitorn/a
Meas. Tech.ChEMBL_1564308 (CHEMBL3784629)
IC50 3000±n/a nM
Citation Ferreira de Freitas, REram, MSSzewczyk, MMSteuber, HSmil, DWu, HLi, FSenisterra, GDong, ABrown, PJHitchcock, MMoosmayer, DStegmann, CMEgner, UArrowsmith, CBarsyte-Lovejoy, DVedadi, MSchapira, M Discovery of a Potent Class I Protein Arginine Methyltransferase Fragment Inhibitor. J Med Chem59:1176-83 (2016) 
 
Histone-arginine methyltransferase CARM1
Name:Histone-arginine methyltransferase CARM1
Type:Protein
Mol. Mass.:65855.47
Organism:Homo sapiens (Human)
Description:Q86X55
Residue:608
BDBM50158095
NameBDBM50158095
Synonyms:CHEMBL3780444
TypeSmall organic molecule
Emp. Form.C5H14N2
Mol. Mass.102.1781
SMILESCNCCN(C)C