Reaction Details
TargetProtein arginine N-methyltransferase 8
LigandBDBM50158094
Substrate/Competitorn/a
Meas. Tech.ChEMBL_1564311 (CHEMBL3784632)
IC50 2100±n/a nM
Citation Ferreira de Freitas, REram, MSSzewczyk, MMSteuber, HSmil, DWu, HLi, FSenisterra, GDong, ABrown, PJHitchcock, MMoosmayer, DStegmann, CMEgner, UArrowsmith, CBarsyte-Lovejoy, DVedadi, MSchapira, M Discovery of a Potent Class I Protein Arginine Methyltransferase Fragment Inhibitor. J Med Chem59:1176-83 (2016) 
 
Protein arginine N-methyltransferase 8
Name:Protein arginine N-methyltransferase 8
Type:Protein
Mol. Mass.:45293.70
Organism:Homo sapiens (Human)
Description:n/a
Residue:394
BDBM50158094
NameBDBM50158094
Synonyms:CHEMBL3780926
TypeSmall organic molecule
Emp. Form.C14H22N2
Mol. Mass.218.3379
SMILESNCCN1CCC(Cc2ccccc2)CC1