Reaction Details
TargetLysine-specific demethylase 4C
LigandBDBM50158790
Substrate/Competitorn/a
Meas. Tech.ChEMBL_1566307 (CHEMBL3788934)
IC50 100±n/a nM
Citation McAllister, TEEngland, KSHopkinson, RJBrennan, PEKawamura, ASchofield, CJ Recent Progress in Histone Demethylase Inhibitors. J Med Chem59:1308-29 (2016) 
 
Lysine-specific demethylase 4C
Name:Lysine-specific demethylase 4C
Type:Protein
Mol. Mass.:119979.01
Organism:Homo sapiens (Human)
Description:Q9H3R0
Residue:1056
BDBM50158790
NameBDBM50158790
Synonyms:CHEMBL3787556 US10807956, Example 80 US11639333, Example 80 US9725441, Example 80 | US9828343, Example 80
TypeSmall organic molecule
Emp. Form.C23H22N2O3
Mol. Mass.374.4324
SMILESOC(=O)c1ccncc1NCC1CCCc2cc(Oc3ccccc3)ccc12