Reaction Details
TargetLysine-specific demethylase 4C
LigandBDBM50158621
Substrate/Competitorn/a
Meas. Tech.ChEMBL_1566307 (CHEMBL3788934)
IC50<100±n/a nM
Citation McAllister, TEEngland, KSHopkinson, RJBrennan, PEKawamura, ASchofield, CJ Recent Progress in Histone Demethylase Inhibitors. J Med Chem59:1308-29 (2016) 
 
Lysine-specific demethylase 4C
Name:Lysine-specific demethylase 4C
Type:Protein
Mol. Mass.:119979.01
Organism:Homo sapiens (Human)
Description:Q9H3R0
Residue:1056
BDBM50158621
NameBDBM50158621
Synonyms:CHEMBL3785421
TypeSmall organic molecule
Emp. Form.C16H10ClF3N2O4
Mol. Mass.386.71
SMILESOC(=O)c1ccnc2cc(OCc3ccc(Cl)c(OC(F)(F)F)c3)[nH]c12