Reaction Details
TargetLysine-specific demethylase 5B
LigandBDBM50158801
Substrate/Competitorn/a
Meas. Tech.ChEMBL_1566311 (CHEMBL3788938)
IC50 100±n/a nM
Citation McAllister, TEEngland, KSHopkinson, RJBrennan, PEKawamura, ASchofield, CJ Recent Progress in Histone Demethylase Inhibitors. J Med Chem59:1308-29 (2016) 
 
Lysine-specific demethylase 5B
Name:Lysine-specific demethylase 5B
Type:Protein
Mol. Mass.:175659.67
Organism:Homo sapiens (Human)
Description:Q9UGL1
Residue:1544
BDBM50158801
NameBDBM50158801
Synonyms:CHEMBL3786617
TypeSmall organic molecule
Emp. Form.C13H11N5O2
Mol. Mass.269.2587
SMILESCn1nc(Nc2cnccc2C(O)=O)c2cccnc12