Reaction Details
TargetLysine-specific demethylase 5A
LigandBDBM50158832
Substrate/Competitorn/a
Meas. Tech.ChEMBL_1566321 (CHEMBL3789200)
IC50 2.3±n/a nM
Citation McAllister, TEEngland, KSHopkinson, RJBrennan, PEKawamura, ASchofield, CJ Recent Progress in Histone Demethylase Inhibitors. J Med Chem59:1308-29 (2016) 
 
Lysine-specific demethylase 5A
Name:Lysine-specific demethylase 5A
Type:Protein
Mol. Mass.:192091.79
Organism:Homo sapiens (Human)
Description:P29375
Residue:1690
BDBM50158832
NameBDBM50158832
Synonyms:CHEMBL3786038
TypeSmall organic molecule
Emp. Form.C18H18N6O2
Mol. Mass.350.3745
SMILESCCc1c(C)[nH]c2c(cnn2c1=O)-c1cnn(c1)-c1cc(CO)ccn1