Reaction Details
TargetLysine-specific demethylase 5A
LigandBDBM50158831
Substrate/Competitorn/a
Meas. Tech.ChEMBL_1566324 (CHEMBL3789203)
EC50 530±n/a nM
Citation McAllister, TEEngland, KSHopkinson, RJBrennan, PEKawamura, ASchofield, CJ Recent Progress in Histone Demethylase Inhibitors. J Med Chem59:1308-29 (2016) 
 
Lysine-specific demethylase 5A
Name:Lysine-specific demethylase 5A
Type:Protein
Mol. Mass.:192091.79
Organism:Homo sapiens (Human)
Description:P29375
Residue:1690
BDBM50158831
NameBDBM50158831
Synonyms:CHEMBL3785443
TypeSmall organic molecule
Emp. Form.C17H20N6O
Mol. Mass.324.3803
SMILESCC(C)Cn1cc(cn1)-c1[nH]c2c(cnn2c(=O)c1C(C)C)C#N