Reaction Details
TargetLysine-specific demethylase 4B
LigandBDBM50158842
Substrate/Competitorn/a
Meas. Tech.ChEMBL_1566040 (CHEMBL3791427)
IC50<1000±n/a nM
Citation McAllister, TEEngland, KSHopkinson, RJBrennan, PEKawamura, ASchofield, CJ Recent Progress in Histone Demethylase Inhibitors. J Med Chem59:1308-29 (2016) 
 
Lysine-specific demethylase 4B
Name:Lysine-specific demethylase 4B
Type:PROTEIN
Mol. Mass.:121904.33
Organism:Homo sapiens (Human)
Description:ChEMBL_109446
Residue:1096
BDBM50158842
NameBDBM50158842
Synonyms:CHEMBL3786644
TypeSmall organic molecule
Emp. Form.C27H27N3O3
Mol. Mass.441.5216
SMILESOC(=O)c1ccc(O)c2ncc(cc12)N1CCCN(CCc2cccc3ccccc23)CC1