Reaction Details
TargetLysine-specific demethylase 2A
LigandBDBM50158852
Substrate/Competitorn/a
Meas. Tech.ChEMBL_1566071 (CHEMBL3791458)
Ki 280±n/a nM
Citation McAllister, TEEngland, KSHopkinson, RJBrennan, PEKawamura, ASchofield, CJ Recent Progress in Histone Demethylase Inhibitors. J Med Chem59:1308-29 (2016) 
 
Lysine-specific demethylase 2A
Name:Lysine-specific demethylase 2A
Type:Enzyme Catalytic Domain
Mol. Mass.:132809.04
Organism:Homo sapiens (Human)
Description:n/a
Residue:1162
BDBM50158852
NameBDBM50158852
Synonyms:CHEMBL3785340
TypeSmall organic molecule
Emp. Form.C21H29IN2
Mol. Mass.436.3728
SMILES[I-].CCCCCC[n+]1ccc(\C=C\c2ccc(cc2)N(C)C)cc1