Reaction Details
TargetInhibitor of growth protein 2
LigandBDBM18959
Substrate/Competitorn/a
Meas. Tech.ChEMBL_1566080 (CHEMBL3791708)
IC50 97000±n/a nM
Citation McAllister, TEEngland, KSHopkinson, RJBrennan, PEKawamura, ASchofield, CJ Recent Progress in Histone Demethylase Inhibitors. J Med Chem59:1308-29 (2016) 
 
Inhibitor of growth protein 2
Name:Inhibitor of growth protein 2
Type:PROTEIN
Mol. Mass.:32812.71
Organism:Homo sapiens (Human)
Description:ChEMBL_116766
Residue:280
BDBM18959
NameBDBM18959
Synonyms:3-{[4-(2-aminoethoxy)-3,5-diiodophenyl]carbonyl}-2-butyl-1-benzofuran DDEA Di-N-desethylamiodarone Methanone
TypeSmall organic molecule
Emp. Form.C21H21I2NO3
Mol. Mass.589.2053
SMILESCCCCc1oc2ccccc2c1C(=O)c1cc(I)c(OCCN)c(I)c1