Reaction Details
TargetLysine-specific demethylase 5A
LigandBDBM50158694
Substrate/Competitorn/a
Meas. Tech.ChEMBL_1566305 (CHEMBL3788932)
IC50 100±n/a nM
Citation McAllister, TEEngland, KSHopkinson, RJBrennan, PEKawamura, ASchofield, CJ Recent Progress in Histone Demethylase Inhibitors. J Med Chem59:1308-29 (2016) 
 
Lysine-specific demethylase 5A
Name:Lysine-specific demethylase 5A
Type:Protein
Mol. Mass.:192091.79
Organism:Homo sapiens (Human)
Description:P29375
Residue:1690
BDBM50158694
NameBDBM50158694
Synonyms:CHEMBL3786803 | US10273222, Example 12
TypeSmall organic molecule
Emp. Form.C17H15N3O3
Mol. Mass.309.3193
SMILESCOc1ccc(cc1)-c1c(ncn1C)-c1cc(ccn1)C(O)=O