Reaction Details
TargetLysine-specific demethylase 5A
LigandBDBM50158695
Substrate/Competitorn/a
Meas. Tech.ChEMBL_1566305 (CHEMBL3788932)
IC50<100±n/a nM
Citation McAllister, TEEngland, KSHopkinson, RJBrennan, PEKawamura, ASchofield, CJ Recent Progress in Histone Demethylase Inhibitors. J Med Chem59:1308-29 (2016) 
 
Lysine-specific demethylase 5A
Name:Lysine-specific demethylase 5A
Type:Protein
Mol. Mass.:192091.79
Organism:Homo sapiens (Human)
Description:P29375
Residue:1690
BDBM50158695
NameBDBM50158695
Synonyms:CHEMBL3787664 | US10273222, Example 16
TypeSmall organic molecule
Emp. Form.C20H19N3O3
Mol. Mass.349.3832
SMILESCn1cnc(c1-c1ccc(OCC2CC2)cc1)-c1cc(ccn1)C(O)=O