Reaction Details
TargetLysine-specific demethylase 2B
LigandBDBM50158858
Substrate/Competitorn/a
Meas. Tech.ChEMBL_1566327 (CHEMBL3789206)
IC50>2500±n/a nM
Citation McAllister, TEEngland, KSHopkinson, RJBrennan, PEKawamura, ASchofield, CJ Recent Progress in Histone Demethylase Inhibitors. J Med Chem59:1308-29 (2016) 
 
Lysine-specific demethylase 2B
Name:Lysine-specific demethylase 2B
Type:Enzyme Catalytic Domain
Mol. Mass.:152658.35
Organism:Homo sapiens (Human)
Description:Q8NHM5
Residue:1336
BDBM50158858
NameBDBM50158858
Synonyms:CHEMBL3786409
TypeSmall organic molecule
Emp. Form.C17H26F3N5O2
Mol. Mass.389.4158
SMILESCCN(CCN(C)C)C(=O)CNCc1cc(CNC(=O)C(F)(F)F)ccn1