Reaction Details
TargetLysine-specific demethylase 4A
LigandBDBM50158858
Substrate/Competitorn/a
Meas. Tech.ChEMBL_1566330 (CHEMBL3789209)
IC50>2500±n/a nM
Citation McAllister, TEEngland, KSHopkinson, RJBrennan, PEKawamura, ASchofield, CJ Recent Progress in Histone Demethylase Inhibitors. J Med Chem59:1308-29 (2016) 
 
Lysine-specific demethylase 4A
Name:Lysine-specific demethylase 4A
Type:Enzyme
Mol. Mass.:120647.83
Organism:Homo sapiens (Human)
Description:O75164
Residue:1064
BDBM50158858
NameBDBM50158858
Synonyms:CHEMBL3786409
TypeSmall organic molecule
Emp. Form.C17H26F3N5O2
Mol. Mass.389.4158
SMILESCCN(CCN(C)C)C(=O)CNCc1cc(CNC(=O)C(F)(F)F)ccn1