Reaction Details
TargetLysine-specific demethylase 5B
LigandBDBM50158858
Substrate/Competitorn/a
Meas. Tech.ChEMBL_1566333 (CHEMBL3789212)
IC50 250±n/a nM
Citation McAllister, TEEngland, KSHopkinson, RJBrennan, PEKawamura, ASchofield, CJ Recent Progress in Histone Demethylase Inhibitors. J Med Chem59:1308-29 (2016) 
 
Lysine-specific demethylase 5B
Name:Lysine-specific demethylase 5B
Type:Protein
Mol. Mass.:175659.67
Organism:Homo sapiens (Human)
Description:Q9UGL1
Residue:1544
BDBM50158858
NameBDBM50158858
Synonyms:CHEMBL3786409
TypeSmall organic molecule
Emp. Form.C17H26F3N5O2
Mol. Mass.389.4158
SMILESCCN(CCN(C)C)C(=O)CNCc1cc(CNC(=O)C(F)(F)F)ccn1