Reaction Details
TargetLysine-specific demethylase 6A
LigandBDBM191598
Substrate/Competitorn/a
Meas. Tech.ChEMBL_1566335 (CHEMBL3789214)
IC50>1000±n/a nM
Citation McAllister, TEEngland, KSHopkinson, RJBrennan, PEKawamura, ASchofield, CJ Recent Progress in Histone Demethylase Inhibitors. J Med Chem59:1308-29 (2016) 
 
Lysine-specific demethylase 6A
Name:Lysine-specific demethylase 6A
Type:Protein
Mol. Mass.:154198.48
Organism:Homo sapiens (Human)
Description:O15550
Residue:1401
BDBM191598
NameBDBM191598
Synonyms:2-(((2-((2-(dimethylamino)ethyl)(ethyl)amino)-2-oxoethyl)amino)methyl)isonicotinic acid (KDM5-C49) KDOAM-20
TypeSmall organic molecule
Emp. Form.C15H24N4O3
Mol. Mass.308.3761
SMILESCCN(CCN(C)C)C(=O)CNCc1cc(ccn1)C(O)=O