Reaction Details
TargetLysine-specific histone demethylase 1A
LigandBDBM113742
Substrate/Competitorn/a
Meas. Tech.ChEMBL_1565785 (CHEMBL3789170)
Ki 59±n/a nM
Citation McAllister, TEEngland, KSHopkinson, RJBrennan, PEKawamura, ASchofield, CJ Recent Progress in Histone Demethylase Inhibitors. J Med Chem59:1308-29 (2016) 
 
Lysine-specific histone demethylase 1A
Name:Lysine-specific histone demethylase 1A
Type:Enzyme
Mol. Mass.:92901.01
Organism:Homo sapiens (Human)
Description:O60341
Residue:852
BDBM113742
NameBDBM113742
Synonyms:N-[4-(2-Hydrazinylethyl)phenyl]-4-phenylbutanamide dihydrochloride salt (12d)
TypeSmall organic molecule
Emp. Form.C18H23N3O
Mol. Mass.297.3947
SMILESNNCCc1ccc(NC(=O)CCCc2ccccc2)cc1