Reaction Details
TargetLysine-specific histone demethylase 1A
LigandBDBM50158872
Substrate/Competitorn/a
Meas. Tech.ChEMBL_1565790 (CHEMBL3789175)
IC50 6.0±n/a nM
Citation McAllister, TEEngland, KSHopkinson, RJBrennan, PEKawamura, ASchofield, CJ Recent Progress in Histone Demethylase Inhibitors. J Med Chem59:1308-29 (2016) 
 
Lysine-specific histone demethylase 1A
Name:Lysine-specific histone demethylase 1A
Type:Enzyme
Mol. Mass.:92901.01
Organism:Homo sapiens (Human)
Description:O60341
Residue:852
BDBM50158872
NameBDBM50158872
Synonyms:CHEMBL3785523
TypeSmall organic molecule
Emp. Form.C16H24N2
Mol. Mass.244.3752
SMILESCN1CCC(CN[C@@H]2C[C@H]2c2ccccc2)CC1