Reaction Details
TargetLysine-specific histone demethylase 1A
LigandBDBM50158875
Substrate/Competitorn/a
Meas. Tech.ChEMBL_1565783 (CHEMBL3789168)
IC50 70±n/a nM
Citation McAllister, TEEngland, KSHopkinson, RJBrennan, PEKawamura, ASchofield, CJ Recent Progress in Histone Demethylase Inhibitors. J Med Chem59:1308-29 (2016) 
 
Lysine-specific histone demethylase 1A
Name:Lysine-specific histone demethylase 1A
Type:Enzyme
Mol. Mass.:92901.01
Organism:Homo sapiens (Human)
Description:O60341
Residue:852
BDBM50158875
NameBDBM50158875
Synonyms:CHEMBL3787372 | US9676701, 69 N-(4′-((trans)-2-aminocyclopropyl)biphenyl-3-yl)propane-2-sulfonamide hydrochloride
TypeSmall organic molecule
Emp. Form.C18H22N2O2S
Mol. Mass.330.444
SMILESCC(C)S(=O)(=O)Nc1cccc(c1)-c1ccc(cc1)[C@H]1C[C@@H]1N