Reaction Details
TargetLysine-specific histone demethylase 1A
LigandBDBM153271
Substrate/Competitorn/a
Meas. Tech.ChEMBL_1565805 (CHEMBL3789190)
IC50 2410±n/a nM
Citation McAllister, TEEngland, KSHopkinson, RJBrennan, PEKawamura, ASchofield, CJ Recent Progress in Histone Demethylase Inhibitors. J Med Chem59:1308-29 (2016) 
 
Lysine-specific histone demethylase 1A
Name:Lysine-specific histone demethylase 1A
Type:Enzyme
Mol. Mass.:92901.01
Organism:Homo sapiens (Human)
Description:O60341
Residue:852
BDBM153271
NameBDBM153271
Synonyms:XZ09
TypeSmall organic molecule
Emp. Form.C25H22ClNO4
Mol. Mass.435.899
SMILESCc1ccc(NC(=O)CCC(=O)OCC(=O)c2ccc(cc2)-c2ccccc2)cc1Cl