Reaction Details
TargetLysine-specific demethylase 4E
LigandBDBM50158888
Substrate/Competitorn/a
Meas. Tech.ChEMBL_1566033 (CHEMBL3791191)
IC50 45000±n/a nM
Citation McAllister, TEEngland, KSHopkinson, RJBrennan, PEKawamura, ASchofield, CJ Recent Progress in Histone Demethylase Inhibitors. J Med Chem59:1308-29 (2016) 
 
Lysine-specific demethylase 4E
Name:Lysine-specific demethylase 4E
Type:Enzyme
Mol. Mass.:56815.71
Organism:Homo sapiens (Human)
Description:B2RXH2
Residue:506
BDBM50158888
NameBDBM50158888
Synonyms:CHEMBL3785984
TypeSmall organic molecule
Emp. Form.C18H23NO3
Mol. Mass.301.3801
SMILESCCCCCCCCOC(=O)c1ccc(O)c2ncccc12