Reaction Details
TargetExcitatory amino acid transporter 3
LigandBDBM50252049
Substrate/Competitorn/a
Meas. Tech.ChEMBL_1568623 (CHEMBL3791056)
IC50>300000±n/a nM
Citation Huynh, THErichsen, MNTora, ASGoudet, CSagot, EAssaf, ZThomsen, CBrodbeck, RStensbøl, TBBjørn-Yoshimoto, WENielsen, BPin, JPGefflaut, TBunch, L New 4-Functionalized Glutamate Analogues Are Selective Agonists at Metabotropic Glutamate Receptor Subtype 2 or Selective Agonists at Metabotropic Glutamate Receptor Group III. J Med Chem59:914-24 (2016) 
 
Excitatory amino acid transporter 3
Name:Excitatory amino acid transporter 3
Type:Enzyme Catalytic Domain
Mol. Mass.:57096.71
Organism:Homo sapiens (Human)
Description:Excitatory Amino Acid EAAT3 0 HUMAN::P43005
Residue:524
BDBM50252049
NameBDBM50252049
Synonyms:(1S,3R)-1-aminopentane-1,3,5-tricarboxylic acid CHEMBL482081
TypeSmall organic molecule
Emp. Form.C8H13NO6
Mol. Mass.219.1919
SMILESN[C@@H](C[C@@H](CCC(O)=O)C(O)=O)C(O)=O