Reaction Details
TargetType-1 angiotensin II receptor
LigandBDBM50236697
Substrate/Competitorn/a
Meas. Tech.ChEMBL_1568947 (CHEMBL3789066)
Ki 0.240000±n/a nM
Citation Keller, MKuhn, KKEinsiedel, JHübner, HBiselli, SMollereau, CWifling, DSvobodová, JBernhardt, GCabrele, CVanderheyden, PMGmeiner, PBuschauer, A Mimicking of Arginine by Functionalized N(¿)-Carbamoylated Arginine As a New Broadly Applicable Approach to Labeled Bioactive Peptides: High Affinity Angiotensin, Neuropeptide Y, Neuropeptide FF, and Neurotensin Receptor Ligands As Examples. J Med Chem59:1925-45 (2016) 
 
Type-1 angiotensin II receptor
Name:Type-1 angiotensin II receptor
Type:Protein
Mol. Mass.:41080.75
Organism:Homo sapiens (Human)
Description:P30556
Residue:359
BDBM50236697
NameBDBM50236697
Synonyms:5-L-isoleucineangiotensin II Angiotensin II CHEMBL408403 L-alpha-aspartyl-L-arginyl-L-valyl-L-tyrosyl-L-isoleucyl-L-histidyl-L-prolyl-L-phenylalanine US9624243, Angiotensin II angiotensin II (mouse) isoleucine(5)-angiotensin II
TypeSmall organic molecule
Emp. Form.C50H71N13O12
Mol. Mass.1046.1786
SMILESCC[C@H](C)[C@H](NC(=O)[C@H](Cc1ccc(O)cc1)NC(=O)[C@@H](NC(=O)[C@H](CCCN=C(N)N)NC(=O)[C@@H](N)CC(O)=O)C(C)C)C(=O)N[C@@H](Cc1cnc[nH]1)C(=O)N1CCC[C@H]1C(=O)N[C@@H](Cc1ccccc1)C(O)=O