Reaction Details
TargetNeurotensin receptor type 1
LigandBDBM50159155
Substrate/Competitorn/a
Meas. Tech.ChEMBL_1569158 (CHEMBL3791104)
Ki 0.690000±n/a nM
Citation Keller, MKuhn, KKEinsiedel, JHübner, HBiselli, SMollereau, CWifling, DSvobodová, JBernhardt, GCabrele, CVanderheyden, PMGmeiner, PBuschauer, A Mimicking of Arginine by Functionalized N(¿)-Carbamoylated Arginine As a New Broadly Applicable Approach to Labeled Bioactive Peptides: High Affinity Angiotensin, Neuropeptide Y, Neuropeptide FF, and Neurotensin Receptor Ligands As Examples. J Med Chem59:1925-45 (2016) 
 
Neurotensin receptor type 1
Name:Neurotensin receptor type 1
Type:PROTEIN
Mol. Mass.:46278.89
Organism:Homo sapiens (Human)
Description:ChEMBL_1453811
Residue:418
BDBM50159155
NameBDBM50159155
Synonyms:CHEMBL3786852
TypeSmall organic molecule
Emp. Form.C51H78F12N14O17
Mol. Mass.1387.2295
SMILESOC(=O)C(F)(F)F.OC(=O)C(F)(F)F.OC(=O)C(F)(F)F.OC(=O)C(F)(F)F.CC[C@H](C)[C@H](NC(=O)[C@H](Cc1ccc(O)cc1)NC(=O)[C@@H]1CCCN1C(=O)[C@H](CCCNC(N)=N)NC(=O)[C@@H](N)CCCN\C(N)=N\C(=O)NCCCCN)C(=O)N[C@@H](CC(C)C)C(O)=O