Reaction Details
TargetNeuropeptide Y receptor type 4
LigandBDBM50159232
Substrate/Competitorn/a
Meas. Tech.ChEMBL_1569168 (CHEMBL3791114)
Ki 0.500000±n/a nM
Citation Keller, MKuhn, KKEinsiedel, JHübner, HBiselli, SMollereau, CWifling, DSvobodová, JBernhardt, GCabrele, CVanderheyden, PMGmeiner, PBuschauer, A Mimicking of Arginine by Functionalized N(¿)-Carbamoylated Arginine As a New Broadly Applicable Approach to Labeled Bioactive Peptides: High Affinity Angiotensin, Neuropeptide Y, Neuropeptide FF, and Neurotensin Receptor Ligands As Examples. J Med Chem59:1925-45 (2016) 
 
Neuropeptide Y receptor type 4
Name:Neuropeptide Y receptor type 4
Type:Enzyme Catalytic Domain
Mol. Mass.:42207.58
Organism:Homo sapiens (Human)
Description:NPY-Y4 PPYR1 HUMAN::P50391
Residue:375
BDBM50159232
NameBDBM50159232
Synonyms:CHEMBL3786263
TypeSmall organic molecule
Emp. Form.C185H286N52O55S2
Mol. Mass.4182.696
SMILESCCC(C)C(NC(=O)C(Cc1ccc(O)cc1)NC(=O)C(CCCNC(N)=N)NC(=O)C(CCCNC(N)=N)NC(=O)C(CC(C)C)NC(=O)C(CC(O)=O)NC(=O)C(C)NC(=O)C(C)NC(=O)C(Cc1ccc(O)cc1)NC(=O)C(CCC(N)=O)NC(=O)C(C)NC(=O)C(CCSC)NC(=O)C(CCC(N)=O)NC(=O)C(CCC(O)=O)NC(=O)C1CCCN1C(=O)C(NC(=O)C(C)NC(=O)C(CC(N)=O)NC(=O)C(CC(O)=O)NC(=O)CNC(=O)C1CCCN1C(=O)C(Cc1ccc(O)cc1)NC(=O)C(NC(=O)C1CCCN1C(=O)C(CCC(O)=O)NC(=O)C(CC(C)C)NC(=O)C1CCCN1C(=O)C(C)N)C(C)C)C(C)O)C(=O)NC(CC(N)=O)C(=O)NC(CCSC)C(=O)NC(CC(C)C)C(=O)NC(C(C)O)C(=O)NC(CCCNC(N)=N)C(=O)N1CCCC1C(=O)NC(CCCNC(N)=N)C(=O)NC(Cc1ccc(O)cc1)C(O)=O