Reaction Details
TargetEpidermal growth factor receptor
LigandBDBM5446
Substrate/Competitorn/a
Meas. Tech.ChEMBL_1566936 (CHEMBL3790960)
IC50 11±n/a nM
Citation Cheng, HNair, SKMurray, BWAlmaden, CBailey, SBaxi, SBehenna, DCho-Schultz, SDalvie, DDinh, DMEdwards, MPFeng, JLFerre, RAGajiwala, KSHemkens, MDJackson-Fisher, AJalaie, MJohnson, TOKania, RSKephart, SLafontaine, JLunney, BLiu, KKLiu, ZMatthews, JNagata, ANiessen, SOrnelas, MAOrr, STPairish, MPlanken, SRen, SRichter, DRyan, KSach, NShen, HSmeal, TSolowiej, JSutton, STran, KTseng, EVernier, WWalls, MWang, SWeinrich, SLXin, SXu, HYin, MJZientek, MZhou, RKath, JC Discovery of 1-{(3R,4R)-3-[({5-Chloro-2-[(1-methyl-1H-pyrazol-4-yl)amino]-7H-pyrrolo[2,3-d]pyrimidin-4-yl}oxy)methyl]-4-methoxypyrrolidin-1-yl}prop-2-en-1-one (PF-06459988), a Potent, WT Sparing, Irreversible Inhibitor of T790M-Containing EGFR Mutants. J Med Chem59:2005-24 (2016) 
 
Epidermal growth factor receptor
Name:Epidermal growth factor receptor
Type:Receptor Kinase Domain
Mol. Mass.:134279.59
Organism:Homo sapiens (Human)
Description:P00533
Residue:1210
BDBM5446
NameBDBM5446
Synonyms:CHEMBL553 Erlotinib N-(3-Ethynylphenyl)-6,7-bis(2-methoxyethoxy)-4-quinazolinamine Monohydrochloride OSI-774 US10189853, erlotinib US11524945, Compound Erlotinib US9730934, Erlotinib cid_176870
TypeSmall organic molecule
Emp. Form.C22H23N3O4
Mol. Mass.393.4357
SMILESCOCCOc1cc2ncnc(Nc3cccc(c3)C#C)c2cc1OCCOC