Reaction Details
TargetEpidermal growth factor receptor
LigandBDBM4779
Substrate/Competitorn/a
Meas. Tech.ChEMBL_1566936 (CHEMBL3790960)
IC50 6.0±n/a nM
Citation Cheng, HNair, SKMurray, BWAlmaden, CBailey, SBaxi, SBehenna, DCho-Schultz, SDalvie, DDinh, DMEdwards, MPFeng, JLFerre, RAGajiwala, KSHemkens, MDJackson-Fisher, AJalaie, MJohnson, TOKania, RSKephart, SLafontaine, JLunney, BLiu, KKLiu, ZMatthews, JNagata, ANiessen, SOrnelas, MAOrr, STPairish, MPlanken, SRen, SRichter, DRyan, KSach, NShen, HSmeal, TSolowiej, JSutton, STran, KTseng, EVernier, WWalls, MWang, SWeinrich, SLXin, SXu, HYin, MJZientek, MZhou, RKath, JC Discovery of 1-{(3R,4R)-3-[({5-Chloro-2-[(1-methyl-1H-pyrazol-4-yl)amino]-7H-pyrrolo[2,3-d]pyrimidin-4-yl}oxy)methyl]-4-methoxypyrrolidin-1-yl}prop-2-en-1-one (PF-06459988), a Potent, WT Sparing, Irreversible Inhibitor of T790M-Containing EGFR Mutants. J Med Chem59:2005-24 (2016) 
 
Epidermal growth factor receptor
Name:Epidermal growth factor receptor
Type:Receptor Kinase Domain
Mol. Mass.:134279.59
Organism:Homo sapiens (Human)
Description:P00533
Residue:1210
BDBM4779
NameBDBM4779
Synonyms:CHEMBL31965 CI-1033 N-{4-[(3-chloro-4-fluorophenyl)amino]-7-[3-(morpholin-4-yl)propoxy]quinazolin-6-yl}prop-2-enamide US10507209, Compound CI-1033 cid_156414
TypeSmall organic molecule
Emp. Form.C24H25ClFN5O3
Mol. Mass.485.938
SMILESFc1ccc(Nc2ncnc3cc(OCCCN4CCOCC4)c(NC(=O)C=C)cc23)cc1Cl