Reaction Details
TargetScavenger receptor class B member 1
LigandBDBM50159546
Substrate/Competitorn/a
Meas. Tech.ChEMBL_1569538 (CHEMBL3789894)
IC50 1000±n/a nM
Citation Sparks, SMZhou, HGeneraux, CHarston, LMoncol, DJayawickreme, CParham, JCondreay, PRimele, T Identification of nonabsorbable inhibitors of the scavenger receptor-BI (SR-BI) for tissue-specific administration. Bioorg Med Chem Lett26:1901-4 (2016) 
 
Scavenger receptor class B member 1
Name:Scavenger receptor class B member 1
Type:PROTEIN
Mol. Mass.:60889.81
Organism:Homo sapiens (Human)
Description:ChEMBL_872680
Residue:552
BDBM50159546
NameBDBM50159546
Synonyms:CHEMBL3786591
TypeSmall organic molecule
Emp. Form.C33H40F3N3O9S
Mol. Mass.711.746
SMILES[O-]C(=O)C(F)(F)F.COc1c(NC(=O)C(=O)c2ccc(OCC[N+]3(C)CCOCC3)c3ccccc23)cc(cc1NS(C)(=O)=O)C(C)(C)C