Reaction Details
TargetC-X-C chemokine receptor type 3
LigandBDBM50399980
Substrate/Competitorn/a
Meas. Tech.ChEBML_1569710
EC50 1280±n/a nM
Citation Milanos, LBrox, RFrank, TPoklukar, GPalmisano, RWaibel, REinsiedel, JDürr, MIvanovic-Burmazovic, ILarsen, OHjortø, GMRosenkilde, MMTschammer, N Discovery and Characterization of Biased Allosteric Agonists of the Chemokine Receptor CXCR3. J Med Chem59:2222-43 (2016) 
 
C-X-C chemokine receptor type 3
Name:C-X-C chemokine receptor type 3
Type:Enzyme Catalytic Domain
Mol. Mass.:40665.65
Organism:Homo sapiens (Human)
Description:n/a
Residue:368
BDBM50399980
NameBDBM50399980
Synonyms:CHEMBL2181467
TypeSmall organic molecule
Emp. Form.C40H44N4O4
Mol. Mass.644.8018
SMILESNCCCC[C@H](NC(=O)[C@@H]1Cc2ccccc2CN1C(=O)CCC(=O)c1ccccc1)C(=O)NCC(c1ccccc1)c1ccccc1