Reaction Details
Target5-hydroxytryptamine receptor 6
LigandBDBM50159770
Substrate/Competitorn/a
Meas. Tech.ChEMBL_1569991 (CHEMBL3789139)
Ki 25±n/a nM
Citation van Loevezijn, AVenhorst, JIwema Bakker, WILange, JHde Looff, WHenzen, Rde Vries, Jvan de Woestijne, RPden Hartog, APVerhoog, Svan der Neut, MAde Bruin, NMKruse, CG Optimization of N'-(arylsulfonyl)pyrazoline-1-carboxamidines by exploiting a novel interaction site in the 5-HT6 antagonistic binding pocket. Bioorg Med Chem Lett26:1605-11 (2016) 
 
5-hydroxytryptamine receptor 6
Name:5-hydroxytryptamine receptor 6
Type:G Protein-Coupled Receptor (GPCR)
Mol. Mass.:46968.43
Organism:Homo sapiens (Human)
Description:P50406
Residue:440
BDBM50159770
NameBDBM50159770
Synonyms:CHEMBL3787508
TypeSmall organic molecule
Emp. Form.C18H25N5O2S
Mol. Mass.375.488
SMILESCCN\C(=N/S(=O)(=O)c1ccc2NCCc2c1)N1CC2(CCCC2)C=N1