Reaction Details
Target5-hydroxytryptamine receptor 6
LigandBDBM50159784
Substrate/Competitorn/a
Meas. Tech.ChEMBL_1569991 (CHEMBL3789139)
Ki 1.8±n/a nM
Citation van Loevezijn, AVenhorst, JIwema Bakker, WILange, JHde Looff, WHenzen, Rde Vries, Jvan de Woestijne, RPden Hartog, APVerhoog, Svan der Neut, MAde Bruin, NMKruse, CG Optimization of N'-(arylsulfonyl)pyrazoline-1-carboxamidines by exploiting a novel interaction site in the 5-HT6 antagonistic binding pocket. Bioorg Med Chem Lett26:1605-11 (2016) 
 
5-hydroxytryptamine receptor 6
Name:5-hydroxytryptamine receptor 6
Type:G Protein-Coupled Receptor (GPCR)
Mol. Mass.:46968.43
Organism:Homo sapiens (Human)
Description:P50406
Residue:440
BDBM50159784
NameBDBM50159784
Synonyms:CHEMBL3785453
TypeSmall organic molecule
Emp. Form.C16H22ClN5O2S
Mol. Mass.383.896
SMILESCCN\C(=N/S(=O)(=O)c1ccc(N)c(Cl)c1)N1CC2(CCCC2)C=N1