Reaction Details
TargetInduced myeloid leukemia cell differentiation protein Mcl-1
LigandBDBM50159947
Substrate/Competitorn/a
Meas. Tech.ChEBML_1565814
Ki 10.0±n/a nM
Citation Pelz, NFBian, ZZhao, BShaw, STarr, JCBelmar, JGregg, CCamper, DVGoodwin, CMArnold, ALSensintaffar, JLFriberg, ARossanese, OWLee, TOlejniczak, ETFesik, SW Discovery of 2-Indole-acylsulfonamide Myeloid Cell Leukemia 1 (Mcl-1) Inhibitors Using Fragment-Based Methods. J Med Chem59:2054-66 (2016) 
 
Induced myeloid leukemia cell differentiation protein Mcl-1
Name:Induced myeloid leukemia cell differentiation protein Mcl-1
Type:Membrane; Single-pass membrane protein
Mol. Mass.:37332.87
Organism:Homo sapiens (Human)
Description:Q07820
Residue:350
BDBM50159947
NameBDBM50159947
Synonyms:CHEMBL3785235
TypeSmall organic molecule
Emp. Form.C27H33Cl2N3O5S
Mol. Mass.582.539
SMILESCC(C)CC(=O)NCCS(=O)(=O)NC(=O)c1[nH]c2cc(Cl)ccc2c1CCCOc1cc(C)c(Cl)c(C)c1