Reaction Details
TargetInduced myeloid leukemia cell differentiation protein Mcl-1
LigandBDBM50160063
Substrate/Competitorn/a
Meas. Tech.ChEMBL_1565816 (CHEMBL3789423)
Ki 7±n/a nM
Citation Pelz, NFBian, ZZhao, BShaw, STarr, JCBelmar, JGregg, CCamper, DVGoodwin, CMArnold, ALSensintaffar, JLFriberg, ARossanese, OWLee, TOlejniczak, ETFesik, SW Discovery of 2-Indole-acylsulfonamide Myeloid Cell Leukemia 1 (Mcl-1) Inhibitors Using Fragment-Based Methods. J Med Chem59:2054-66 (2016) 
 
Induced myeloid leukemia cell differentiation protein Mcl-1
Name:Induced myeloid leukemia cell differentiation protein Mcl-1
Type:Membrane; Single-pass membrane protein
Mol. Mass.:37332.87
Organism:Homo sapiens (Human)
Description:Q07820
Residue:350
BDBM50160063
NameBDBM50160063
Synonyms:CHEMBL3785313
TypeSmall organic molecule
Emp. Form.C41H38Cl2F3N5O5S
Mol. Mass.840.737
SMILESCc1nn(C)c(C)c1-c1c(Cl)ccc2c(CCCOc3cc(C)c(Cl)c(C)c3)c([nH]c12)C(=O)NS(=O)(=O)c1cccc(CNC(=O)c2cccc(c2)C(F)(F)F)c1