Reaction Details
TargetInduced myeloid leukemia cell differentiation protein Mcl-1
LigandBDBM50160023
Substrate/Competitorn/a
Meas. Tech.ChEMBL_1565816 (CHEMBL3789423)
IC50 2.1±n/a nM
Citation Pelz, NFBian, ZZhao, BShaw, STarr, JCBelmar, JGregg, CCamper, DVGoodwin, CMArnold, ALSensintaffar, JLFriberg, ARossanese, OWLee, TOlejniczak, ETFesik, SW Discovery of 2-Indole-acylsulfonamide Myeloid Cell Leukemia 1 (Mcl-1) Inhibitors Using Fragment-Based Methods. J Med Chem59:2054-66 (2016) 
 
Induced myeloid leukemia cell differentiation protein Mcl-1
Name:Induced myeloid leukemia cell differentiation protein Mcl-1
Type:Membrane; Single-pass membrane protein
Mol. Mass.:37332.87
Organism:Homo sapiens (Human)
Description:Q07820
Residue:350
BDBM50160023
NameBDBM50160023
Synonyms:CHEMBL3785263
TypeSmall organic molecule
Emp. Form.C31H30Cl2N4O7S
Mol. Mass.673.564
SMILESCc1nn(C)c(C)c1-c1c(Cl)ccc2c(CCCOc3cc(C)c(Cl)c(C)c3)c([nH]c12)C(=O)NS(=O)(=O)c1ccc(o1)C(O)=O