Reaction Details
TargetBcl-2-like protein 1
LigandBDBM50159996
Substrate/Competitorn/a
Meas. Tech.ChEMBL_1565819 (CHEMBL3789426)
Ki 1109±n/a nM
Citation Pelz, NFBian, ZZhao, BShaw, STarr, JCBelmar, JGregg, CCamper, DVGoodwin, CMArnold, ALSensintaffar, JLFriberg, ARossanese, OWLee, TOlejniczak, ETFesik, SW Discovery of 2-Indole-acylsulfonamide Myeloid Cell Leukemia 1 (Mcl-1) Inhibitors Using Fragment-Based Methods. J Med Chem59:2054-66 (2016) 
 
Bcl-2-like protein 1
Name:Bcl-2-like protein 1
Type:Mitochondrion membrane; Single-pass membrane protein
Mol. Mass.:26039.60
Organism:Homo sapiens (Human)
Description:n/a
Residue:233
BDBM50159996
NameBDBM50159996
Synonyms:CHEMBL3786327
TypeSmall organic molecule
Emp. Form.C39H40Cl2N6O4S
Mol. Mass.759.744
SMILESCc1nn(C)c(C)c1-c1c(Cl)ccc2c(CCCOc3cc(C)c(Cl)c(C)c3)c([nH]c12)C(=O)NS(=O)(=O)c1ccnc(NCCc2ccccc2)c1