Reaction Details
TargetPhosphatidylinositol 4,5-bisphosphate 3-kinase catalytic subunit gamma isoform
LigandBDBM50042924
Substrate/Competitorn/a
Meas. Tech.ChEMBL_1565822 (CHEMBL3789429)
IC50 17±n/a nM
Citation Rutaganira, FUFowler, MLMcPhail, JAGelman, MANguyen, KXiong, ADornan, GLTavshanjian, BGlenn, JSShokat, KMBurke, JE Design and Structural Characterization of Potent and Selective Inhibitors of Phosphatidylinositol 4 Kinase IIIß. J Med Chem59:1830-9 (2016) 
 
Phosphatidylinositol 4,5-bisphosphate 3-kinase catalytic subunit gamma isoform
Name:Phosphatidylinositol 4,5-bisphosphate 3-kinase catalytic subunit gamma isoform
Type:Enzyme Subunit
Mol. Mass.:126470.30
Organism:Homo sapiens (Human)
Description:P48736
Residue:1102
BDBM50042924
NameBDBM50042924
Synonyms:CHEMBL1229535
TypeSmall organic molecule
Emp. Form.C14H16ClN3O4S2
Mol. Mass.389.878
SMILESCC(=O)\N=c1\[nH]c(C)c(s1)-c1ccc(Cl)c(c1)S(=O)(=O)NCCO