Reaction Details
TargetPhosphatidylinositol 4,5-bisphosphate 3-kinase catalytic subunit gamma isoform
LigandBDBM50160066
Substrate/Competitorn/a
Meas. Tech.ChEMBL_1565822 (CHEMBL3789429)
IC50 21±n/a nM
Citation Rutaganira, FUFowler, MLMcPhail, JAGelman, MANguyen, KXiong, ADornan, GLTavshanjian, BGlenn, JSShokat, KMBurke, JE Design and Structural Characterization of Potent and Selective Inhibitors of Phosphatidylinositol 4 Kinase IIIß. J Med Chem59:1830-9 (2016) 
 
Phosphatidylinositol 4,5-bisphosphate 3-kinase catalytic subunit gamma isoform
Name:Phosphatidylinositol 4,5-bisphosphate 3-kinase catalytic subunit gamma isoform
Type:Enzyme Subunit
Mol. Mass.:126470.30
Organism:Homo sapiens (Human)
Description:P48736
Residue:1102
BDBM50160066
NameBDBM50160066
Synonyms:CHEMBL3787634
TypeSmall organic molecule
Emp. Form.C14H16BrN3O4S2
Mol. Mass.434.329
SMILESCC(=O)Nc1nc(C)c(s1)-c1ccc(Br)c(c1)S(=O)(=O)NCCO