Reaction Details
TargetPhosphatidylinositol 4,5-bisphosphate 3-kinase catalytic subunit delta isoform
LigandBDBM50160070
Substrate/Competitorn/a
Meas. Tech.ChEMBL_1565823 (CHEMBL3789430)
IC50 340±n/a nM
Citation Rutaganira, FUFowler, MLMcPhail, JAGelman, MANguyen, KXiong, ADornan, GLTavshanjian, BGlenn, JSShokat, KMBurke, JE Design and Structural Characterization of Potent and Selective Inhibitors of Phosphatidylinositol 4 Kinase IIIß. J Med Chem59:1830-9 (2016) 
 
Phosphatidylinositol 4,5-bisphosphate 3-kinase catalytic subunit delta isoform
Name:Phosphatidylinositol 4,5-bisphosphate 3-kinase catalytic subunit delta isoform
Type:Enzyme Subunit
Mol. Mass.:119489.41
Organism:Homo sapiens (Human)
Description:O00329
Residue:1044
BDBM50160070
NameBDBM50160070
Synonyms:CHEMBL3786159
TypeSmall organic molecule
Emp. Form.C18H22ClN3O4S2
Mol. Mass.443.968
SMILESCc1nc(NC(=O)C2CCCC2)sc1-c1ccc(Cl)c(c1)S(=O)(=O)NCCO